{"text_format":"1","workbook":"xlsx","n_sheets":5,"sheets":["Student Tracker","Summary","Instructions","Lists 1","Lists 2"],"not_rendered":{"charts":0,"images":2,"macros":0,"external_links":0,"defined_names":41,"comments":0,"pivot_tables":0},"unopened":[],"bounds":{"document_bytes":16777216,"sheet_cells":100000,"rows_first":2000,"rows_last":500,"rows_between":2000,"halvings":0,"cell_chars":16384,"cell_head_chars":4096},"cells_cut":0,"cells_raw":0,"read":"row_number_cap","date_system":"1900"}

{"sheet":"Student Tracker","index":0,"n_rows":3,"n_cols":25,"rows_kept":3,"cut":false,"hidden":false,"merged":[[1,3,1,12],[1,0,1,1],[1,13,1,24],[0,0,0,24]],"read":"row_number_cap"}
["New Enrollment_COVID-19"]
["Grantee Information",null,null,"Student Information",null,null,null,null,null,null,null,null,null,"Class Information"]
["Grantee Name ","Provider Name ",null,"Last Name","First Name","Middle Name","Enrollment Form Signed? ","Release of Information Signed ? ","Compulsory Attendance Exemption Required?","Eligibility Determined By ","TEAMS Participant ID","LAN Number (Optional)(in TEAMS)","Enrollment Date",null,"Class Name ","Class Number ","Class Start Date ","Activity/Fund Code","Coursework ","Distance Learning Model ","Distance Learning Curriculum ","Assigned Instructor ","Total Direct Hours","Total Proxy Hours","Total Training Hours"]

{"sheet":"Summary","index":1,"n_rows":2,"n_cols":6,"rows_kept":2,"cut":false,"hidden":false,"merged":[]}
["Number of Students","Number of Students Without a Signed Enrollment Form","Number of Students Without a Signed Release Form ","Number of Students Enrolled in March","Number of Students Enrolled in April ","Number of Students Enrolled in May"]
[{"$f":"COUNTIF('Student Tracker'!K4:K1500,\"*\")","v":0},{"$f":"COUNTIF('Student Tracker'!G4:G1500,\"No\")","v":0},{"$f":"COUNTIF('Student Tracker'!H4:H1500,\"No\")","v":0},{"$f":"SUMPRODUCT(1*(MONTH('Student Tracker'!M4:M1500)=3))","v":0},{"$f":"SUMPRODUCT(1*(MONTH('Student Tracker'!M4:M1500)=4))","v":0},{"$f":"SUMPRODUCT(1*(MONTH('Student Tracker'!M4:M1500)=5))","v":0}]

{"sheet":"Instructions","index":2,"n_rows":24,"n_cols":2,"rows_kept":24,"cut":false,"hidden":false,"merged":[]}
["Column Header ","Description"]
["Grantee Name ","Select your Grantee "]
["Provider Name ","Select the Povider associated with the Grantee you selected"]
["Last Name","Last Name of New Student"]
["First Name","First Name of New Student"]
["Middle Name","Middle Name or Initial of New Student"]
["Enrollment Form Signed? ","Dropdown option , Yes or No. Select Yes if enrollment form has a permissible signature per FAQ guidance. Select No if it does not and you will have to obtain at a later date."]
["Release of Information Signed ? ","Dropdown option , Yes or No. Select Yes if Release of Information form has a permissible signature per FAQ guidance. Select No if it does not and you will have to obtain at a later date."]
["Compulsory Attendance Exemption Required?","Dropdown option , Yes or No. Select Yes if the individual is 16-18 years old without a HS diploma or equivalent. Select No if they are 18+. This will allow you to monitor additional eligibility documentation required for these individuals. If Yes is selected, ensure exemption is documented per AEL Letter 05-17 "]
["Eligibility Determined By ","Select which 'staff determined' eligibility is being applied to enroll student into services w/out a pre-test"]
["TEAMS Participant ID","After creating a participant record in TEAMS, use the unique Participant ID number generated by the system"]
["LAN Number (Optional)(in TEAMS)","Optional--enter a locally assigned number"]
["Enrollment Date","Date all the intake documents were completed, should be prior to class start date"]
["Class Name ","Class name "]
["Class Number ","Class number"]
["Class Start Date ","Date new student was assigned to a remote or distance learning class"]
["Activity/Fund Code","Activity/Fund code student is participating in according to AEL Letter 01-20, att 3: https://twc.texas.gov/files/policy_letters/attachments/AEL%2001-20att.3%20.pdf"]
["Coursework ","Dropdown, select appropriate coursework based on class instruction"]
["Distance Learning Model ","Dropdown, Select one of the three options : Clocktime, Mastery , or Teacher Certification"]
["Distance Learning Curriculum ","Select the approved curriculim or module student is utilizing "]
["Assigned Instructor ","Literacy Instructor(s) assigned to the class"]
["Total Direct Hours","Updated each month prior to submission to TWC to reflect the cumulative direct hours"]
["Total Proxy Hours","Updated each month prior to submission to TWC to reflect the cumulative proxy hours"]
["Total Training Hours","Updated each month prior to submission to TWC to reflect the cumulative training hours"]

{"sheet":"Lists 1","index":3,"n_rows":21,"n_cols":37,"rows_kept":21,"cut":false,"hidden":true,"merged":[]}
["Abilene","AmarilloCollege","AngelinaAELConsortium","AustinCommunityCollege","BrazosValley","BrownsvilleISD","CentralTexasCollege","CommunityActionInc.","DallasCountyLWDBforDallasAELConsortium","ESC_XX","GraysonCollege_NorthCentral","GraysonCollege_Texoma","HGAC_Consortium","HowardCollege_ConchoValley","HowardCollege_PermianBasin","LaredoCollege","LiteracyCouncilofTylerConsortium","McLennanCommunityCollege","MidlandCollege","NavarroCollege","NewDentonISD","OdessaCollege","ParisJuniorCollege_RedRiverValleyAELConsortium","ParisJuniorCollege_NorthCentral","RegionI","RegionII","RegionIX","RegionV","RegionXVII_PermianBasin","RegionXVII_SouthPlains","SouthwestTexasJuniorCollege","TempleCollege","TexarkanaCollege","VictoriaCountyJuniorCollege","WeatherfordISD","WorkforceSolutions_TarrantCounty","YsletaISD_FarWestAELConsortium"]
["Abilene ISD","Amarillo College","Angelina College","Advocacy Outreach","Blinn College","Brownsville ISD","Central Texas College","Austin Community College","Dallas County Community College District","Alamo Colleges","Grayson College North Central","Grayson County College","A.A.M.A.","Howard College San Angelo","Howard College","Laredo College","Angelina College","McLennan Community College","Midland College","Navarro College","Denton ISD","Odessa College","Northeast Texas Community College","Paris Junior College","Region One","Del Mar College","Region 9 ESC","ABC Southeast Texas","Seminole ISD","Convenant Hospital","Southwest Texas Junior College","Central Texas College","Texarkana College","Gonzales Intermediate Sanctions Facility","Weatherford College","Arlington ISD","El Paso ISD"]
["Patty Hanks School of Nursing",null,"Panola College-Center","American YouthWorks","Brazos County Jail","Texas State Technical College",null,"Community Action Inc.","Dallas County LWDB/Consortium","Comal ISD",null,null,"Adult Education Center, Pearland",null,null,"Laredo Community College","East Texas Literacy Council",null,null,"Training Academy 4 U, LLC","Flowers Baking Company",null,"Paris Junior College",null,"South Texas College","Region 2, ESC",null,"Lamar Institute Technology",null,"Denver City ISD",null,"Temple College",null,"Victoria College","Weatherford ISD","Arlington Public Library","Presidio ISD"]
[null,null,null,"Austin Career Institute ATX","Madisonville CISD","TSC",null,null,"Irving ISD","Each One Teach One",null,null,"Alliance for MultiCultural Community Services",null,null,null,"Jacksonville Literacy Council",null,null,null,"Hill College",null,null,null,null,null,null,"Lamar State College- Port Arthur",null,"First Batist Church Meadow",null,null,null,null,null,"Birdville ISD","Socorro ISD"]
[null,null,null,"Austin Community College","Workforce Solutions Brazos Valley Board","Youth Build",null,null,"Richardson ISD","North East ISD",null,null,"BakerRipley",null,null,null,"Kilgore College",null,null,null,"LMC Lattimore Materials Company",null,null,null,null,null,null,"Region 5 Education Service Center",null,"Goodwill Industries of Lubbock",null,null,null,null,null,"Ft. Worth ISD","Ysleta ISD"]
[null,null,null,"Austin ISD",null,null,null,null,"Wilkinson Center","Northside ISD",null,null,"Boys & Girls Club of Walker County",null,null,null,"Literary Council of Tyler",null,null,null,"North Central Texas College",null,null,null,null,null,null,null,null,"Levelland ISD",null,null,null,null,null,"Tarrant County College"]
[null,null,null,"Austin Learning Academy",null,null,null,null,null,"Region 20 ESC San Antonio, TX",null,null,"Brazosport College",null,null,null,"New Summerfield ISD",null,null,null,null,null,null,null,null,null,null,null,null,"Littlefield Library",null,null,null,null,null,"Tarrant Literacy Coalition"]
[null,null,null,"Central Texas Communities in Schools",null,null,null,null,null,"Restore Education",null,null,"Chinese Community Center",null,null,null,"Northeast Texas Community College",null,null,null,null,null,null,null,null,null,null,null,null,"Lockney ISD",null,null,null,null,null,"The Learning Center of North Texas"]
[null,null,null,"Goodwill_ATX",null,null,null,null,null,"San Antonio ISD",null,null,"College of the Mainland",null,null,null,"Palestine ISD",null,null,null,null,null,null,null,null,null,null,null,null,"Lubbock ISD",null,null,null,null,null,"Workforce Solutions for Tarrant County"]
[null,null,null,"LCCT-The Learning Center",null,null,null,null,null,"Southwest Texas Junior College",null,null,"Community Family Centers",null,null,null,"Panola College Campus",null,null,null,null,null,null,null,null,null,null,null,null,"Mae Simmons Community Center"]
[null,null,null,"Lifeworks",null,null,null,null,null,null,null,null,"Harris County Department of Education",null,null,null,"Trinity Valley Community College",null,null,null,null,null,null,null,null,null,null,null,null,"Meadow ISD"]
[null,null,null,"SkillPoint Alliance_ATX",null,null,null,null,null,null,null,null,"Houston Community College System",null,null,null,"Trinity Valley Community College-ATX",null,null,null,null,null,null,null,null,null,null,null,null,"My Father's House"]
[null,null,null,null,null,null,null,null,null,null,null,null,"Lee College-Huntsville",null,null,null,"Tyler Junior College",null,null,null,null,null,null,null,null,null,null,null,null,"Olton ISD"]
[null,null,null,null,null,null,null,null,null,null,null,null,"Lone Star College System",null,null,null,"Tyler Rose Hispanic Business Alliance",null,null,null,null,null,null,null,null,null,null,null,null,"Our Lady of Guadalupe Church"]
[null,null,null,null,null,null,null,null,null,null,null,null,"San Jacinto College",null,null,null,"Upshur County Literacy Program",null,null,null,null,null,null,null,null,null,null,null,null,"Petersburg ISD"]
[null,null,null,null,null,null,null,null,null,null,null,null,"Wharton County Junior College",null,null,null,null,null,null,null,null,null,null,null,null,null,null,null,null,"Plainview ISD"]
[null,null,null,null,null,null,null,null,null,null,null,null,null,null,null,null,null,null,null,null,null,null,null,null,null,null,null,null,null,"Post ISD"]
[null,null,null,null,null,null,null,null,null,null,null,null,null,null,null,null,null,null,null,null,null,null,null,null,null,null,null,null,null,"Region XVII ESC"]
[null,null,null,null,null,null,null,null,null,null,null,null,null,null,null,null,null,null,null,null,null,null,null,null,null,null,null,null,null,"South Plains Community Action Assoc."]
[null,null,null,null,null,null,null,null,null,null,null,null,null,null,null,null,null,null,null,null,null,null,null,null,null,null,null,null,null,"St. Michael's Church"]
[null,null,null,null,null,null,null,null,null,null,null,null,null,null,null,null,null,null,null,null,null,null,null,null,null,null,null,null,null,"Workforce Solutions South Plains"]

{"sheet":"Lists 2","index":4,"n_rows":26,"n_cols":4,"rows_kept":26,"cut":false,"hidden":true,"merged":[]}
["Eligibility","Coursework","DistanceLearningModel","DistanceLearningCurriculum"]
["Basic Skills Deficient","Multi-coursework ABE/ESL/ASE","Clocktime","Aztec"]
["Does not have a secondary school diploma or its recognized equivalent","ESL General Studies","Mastery","Burlington English"]
["English Language Learner","ABE General Studies (0-8 GE)","Teacher Certification","California Distance"]
[null,"ASE General Studies (9-12 GE)",null,"Cell-Ed"]
[null,"TSI Prep",null,"Core Skills Mastery"]
[null,"IET",null,"Crossroads Café"]
[null,"Integrated EL Civics",null,"Edmentum: PLATO (only)"]
[null,"Workplace Literacy",null,"English Discoveries"]
[null,"Workforce Prep Activities",null,"Essential Education: GED Academy, HiSET Academy, or TASC Academy"]
[null,"Digital Literacy",null,"i-Pathways:Learning Pathways in Adult Education"]
[null,null,null,"ITTS-McGraw Hill"]
[null,null,null,"Knewton Alta"]
[null,null,null,"Learning Upgrade"]
[null,null,null,"Learning Online Through Universal System (LOTUS)"]
[null,null,null,"Madison Heights Lifelines"]
[null,null,null,"McGraw Hill LearnSmart \"Achieve\""]
[null,null,null,"Pearson My Lab Series"]
[null,null,null,"Pre-GED Connection"]
[null,null,null,"Reading Horizons Elevate"]
[null,null,null,"Rosetta Stone"]
[null,null,null,"Skills Tutor"]
[null,null,null,"USA Learns: 1st English Course"]
[null,null,null,"USA Learns: 2nd English Course"]
[null,null,null,"Workplace Essential Skills"]
[null,null,null,"Voxy"]